BDBM50300124 (5-(phenylsulfinyl)-1H-benzimidazol-2-yl)carbamic acid methyl ester::5-(phenylsulfinyl)-2-benzimidazolecarbamic acid methyl ester::5-phenylsulfinyl-2-carbomethoxyaminobenzimidazole::CHEMBL42442::Fenbendazole sulfoxide::OFDZ::methyl [5-(phenylsulfinyl)-1H-benzimidazol-2-yl]carbamate::oxfendazole
SMILES COC(=O)Nc1nc2ccc(cc2[nH]1)S(=O)c1ccccc1
InChI Key InChIKey=BEZZFPOZAYTVHN-UHFFFAOYSA-N
Data  1 IC50
  Tab Delimited (TSV)   2D SDfile   Computed 3D by Vconf -m prep SDfile
Find this compound or compounds like it in BindingDB:
Activity Spreadsheet -- Enzyme Inhibition Constant Data from BindingDB
Found 1 hit for monomerid = 50300124
TargetHematopoietic prostaglandin D synthase(Homo sapiens (Human))
The University Of Queensland
Curated by ChEMBL
LigandPNGBDBM50300124((5-(phenylsulfinyl)-1H-benzimidazol-2-yl)carbamic ...)
Affinity DataIC50: >3.00E+5nM. Assay description: Inhibition of human H-PGDS expressed in Escherichia coli BL21 assessed as rate of glutathione-chloro-dinitro benzene conjugation
In DepthDetails ArticlePubMed